ftaasac, found the prism bug. it's caused by mozilla bug 46277400:50
ubottuMozilla bug 462774 in General "drop JSON.jsm" [Normal,Resolved: fixed] http://bugzilla.mozilla.org/show_bug.cgi?id=46277400:50
ftalike for epiphany, restricting prism to xul 1.9.0.* helped00:51
gnomefreaki have sound :)09:55
gnomefreakanyone know nafun@jabber.ccc.de is?10:14
asacgnomefreak: huh?10:42
asacgnomefreak: i am on jabber.ccc.de10:42
asacno idea who nafun is ;)10:42
gnomefreakasac nafun wanted me to add it so making sure its not someone from here10:42
rZrasac: hi hey you're member of ccc ? I planned to move to ccc camp coup of years ago10:43
gnomefreakisnt ccc.* open to all?10:44
* gnomefreak not sure who i am on jabber10:45
asacrZr: not member ... just jabber10:45
gnomefreakoh crap today is the first :(10:45
gnomefreakoh no it isnt10:46
gnomefreakasac: any idea on why IMAP has so many problems?11:04
gnomefreakbug 30232011:06
ubottuLaunchpad bug 302320 in mozilla-thunderbird "Thunderbird Template is deleted when right clicking on message body" [Undecided,Incomplete] https://launchpad.net/bugs/30232011:06
gnomefreakasac: did you change your mind on bug 130255?11:13
ubottuLaunchpad bug 130255 in firefox "Wish: Please default-accept CAcert.org SSL Certificates" [Wishlist,Won't fix] https://launchpad.net/bugs/13025511:13
gnomefreaknevermind the idiot wasnt reading before posting11:13
asacgnomefreak: no11:38
asacgnomefreak: CAcert has known weaknesses in their certification process11:38
asacso its not really trust-worthy11:38
gnomefreaki agree11:38
* directhex is trustworthy, offers to sign peoples' certificates for beer11:38
gnomefreaki dont like this bug :( one of your wontfix bugs ;)11:38
gnomefreakdirecthex: i finished that package11:39
gnomefreakits in my PPA11:39
directhexgnomefreak, which package, sorry?11:39
gnomefreakasac: bug 266946 should stay as wont fix IMHO but this will chnage with the QT port for FF11:40
ubottuLaunchpad bug 266946 in firefox-3.0 "firefox installs unnecessary packages when installing on KDE" [High,Confirmed] https://launchpad.net/bugs/26694611:40
gnomefreakdirecthex: you asked about startupmanager on 11/25 im fairly sure it was you11:41
directhexdid i?11:41
gnomefreakyes but please dont make me look it up in logs ;)11:42
gnomefreakasac: i'm debating on flashgot since it NEEDS a download manager we have a few AFAIK it just seems alot of work however people do use it alot11:43
* gnomefreak smoke11:43
asacgnomefreak: for the KDE thing the most important issue is ubufox. it currently pulls in half of gnome11:52
asacgnomefreak: the bug in general is valid though ... after a bunch of discussions i admitted that11:52
gnomefreakok but are we porting ubufox for QT?11:55
gnomefreaksounds good to me bug its gonna be a pain in the ass since it has so many deps11:58
* gnomefreak needs to eat and head to show for an hour or so to log in new work so gary can start today11:58
gnomefreakok ill be back12:01
asacdirecthex: gnomefreak: its not really ubufox. its apturl that needs to better support kde12:08
=== asac_ is now known as asac
=== rZr is now known as RzR
ftaasac, how come build-system.tar.gz is no longer in hardy?14:01
asacfta: i thought this was introduced in intrepid14:14
asacfta: most likely you had a backport from .head branch in your ppa? and now that archive is higher you see this regression?14:15
asaci guess that means we need livemargins packaged14:17
asacaka Juice14:17
asacgreat that mozilla releases non-free stuff now14:18
asacor isnt that an official mozilla product?14:19
asacasked on blog comment?14:21
asacseems to be released by mozilla bejing14:26
asacat from http://blog.mozilla.com/ligong/about/14:26
asac^^ bumb14:29
asacarmin76: ^^14:29
asacfta: whats going on with 1.9.1? are the jemalloc issues sorted?14:30
ftanot yet, i wanted nspr/nss, or maybe it could wait14:31
asacfta: as long as it doesnt need those versions at build time i would not wait for them14:32
asacfta: have you tested nspr/nss?14:32
ftanot yet.14:32
asacfta: for me stuff works fine. shlibs-control file was intentionally dropped because it doesnt work with "unversioned" sonames as it seems14:33
asacso we just have symbols14:33
asacbut that seems to work during build time here14:33
asacalso symbols are properly auto-regenerated14:33
asacand i upgraded just binaries and saw no regressions14:33
asaconly test missing is whether our xulrunner built against that really works with upstream nspr/nss14:34
asacbut i tested that last time afair14:34
* asac spins xul14:37
ftai'm pushing xul/ff. we'll see later on.14:38
asaci think archive admins might need a bit until they approve it14:39
asacwe can try to get pittis attention before if we want it14:40
ftaasac, xul uploaded15:00
asacgood ... ffox too?15:02
asacboth with bug in changelog?15:02
ftai'm on it15:02
asac(pleaes bug id)15:02
asacjames_w: bzr: ERROR: Could not find .changes file: ../builds/network-manager_0.7~~svn20081018t105859-0ubuntu1.8.10.1~0hardy~nm1_i386.changes.15:02
asacthats what i am usually getting when a -S -sd build succeeds15:02
asacin consequence, the results are not copied to result-dir15:02
james_wwhat command are you running?15:03
asacjames_w: http://paste.ubuntu.com/77759/15:03
asacthats the start and then end ;)15:03
james_wyou need a "-S"15:04
james_wa second one, outside of the build command15:04
asacjames_w: ok i understand. but why? couldnt you just say: copy all .changes that were created?15:04
asace.g. always test for source + binary changes ... and copy those over that exist15:05
james_wyou could15:05
james_wbut what if you had a build command that put the changes somewhere other than ..15:05
james_wand you had an old bust _source.changes in ..15:06
asacjames_w: as long as you find a matching one, thats not a problem imo15:06
asacso: none found -> error15:06
asacone or both found -> use that15:06
james_wthen it would copy the bust one and you might not realise15:06
asacdebuild ends with error code -> fail15:06
james_wand both found means you don't really know15:06
asacjames_w: but how is that now different?15:06
asacjames_w: you never know that the .changes is the one produced by the build do you?15:07
james_wyes, it's not ideal if you have a build command that puts things elsewhere than ..15:07
james_wbug this is conservative at least15:07
asacjames_w: personally i think its not a problem15:07
asacjames_w: build commands should just do normal things.15:07
asacbut my case is quiet normal15:07
asacjames_w: if build command doesnt put results in the build-dir its all busted anyway15:08
asacjames_w: does dpkg-buildpackage or debuild support to put results elsewhere?15:09
james_wpdebuild does it15:09
asacyeah. but still this bug seems unrelated15:10
asace.g. if you do it now, and have old files in build-dir then the behaviour will do bad things too15:10
asacyou could do feasibility tests by looking at timestamps15:11
asac(for this issue)15:11
asacbut then, people often mess up time-syncs in local nets15:12
asacso i think there is really not much you can do for users that specify a custom output dir in build command15:12
ftai wish we had sqlite >= 3.6.415:12
asacjames_w: oh. another idea is to look at result-dir before starting15:12
asacif there are matching changes -> remember timestamps and then check whether they were modified after build15:13
asacfta: i wish we had whatever version moz uses now again ;)15:13
ftait's the same wish then :)15:14
asacfta: what was the 3.1 bug?15:14
asacfta: they backed out for b215:14
asacprobably relanded for b3pre15:14
ftabug 274187 ?15:15
ubottuLaunchpad bug 274187 in ubuntu "FFe - firefox 3.1 and xulrunner 1.9.1 for intrepid/universe" [Wishlist,Won't fix] https://launchpad.net/bugs/27418715:15
asacok let me remove FFe15:15
asacand open jaunty task15:15
ftathere's a bunch of new in-source libs for <video> that we don't have system wide (or that we have but not fresh enough) :(15:17
ftabasically, moz is working with upstream to they are importing snapshots every few days15:18
asacfta: yeah. makes sense to not do the same for syslibs, but keep using the in-source ones until this settles15:19
ftayep, that's why i didn't spend a second on that15:19
asacif you ask me its unlikely that 3.1 will become final in time for jaunty15:20
asacfta: do you see this random menu auto-activiation bug in 3.1?15:24
asaci thnk ijust saw it once15:24
asacin 3.015:24
asacwhen clicking on bookmarks it opened "bookmark this page ..."15:24
asacand i am 100% sure i didnt even move the mouse15:24
asacbecause i just a thinkpad mouse pointer ...15:25
asacand it doesnt move at all untill i touch it15:25
ftai was with b2pre, but strangely enough, with b2 i don't. i just didn't force the extensions (yet)15:25
asacso maybe extension related15:26
asacbut i think o nbug people claim that even all extensions disabled dont help15:27
ftaso my issue may be a different one. i have 26 extensions.. difficult to tell15:28
asacfta: for now i would think its not extension related15:29
asacfta: you saw the same issue with bookmark this page right?15:29
ftawith all the menus in the bm toolbar15:30
asacfta: do you have mouse gestures?15:30
asacfta: menus in the bm toolbar?15:30
asaci dont have a menu there15:30
asacok reproduced here with all extensions disabled (3.0)15:31
ftaa left click selected an item (the 1st one?) while it should have opened the menu, while a click + hold did the right thing.15:31
asacwith history15:31
asaci have about 1:20 (fail:success)15:31
asacfta: ah ... you say it happens for bookmark folders15:32
asacso there have to be even two bugs:15:32
asac(either, or i think)15:33
asac1) button release gets converted to click event even when button release is over a different UI element than the previous button press15:33
asac2) event bubbles to menu, and menu doesnt properly process "out-of-window" events15:34
asac(that could be a missing negative integer check)15:34
asacsince i am sure my pointer doesnt intersect with menu action i would go for 2) for now15:35
ftamozilla bug 44944315:41
ubottuMozilla bug 449443 in Storage "Upgrade to SQLite 3.6.4" [Normal,Resolved: fixed] http://bugzilla.mozilla.org/show_bug.cgi?id=44944315:41
ftano backout since15:42
asacfta: i think on release branch15:45
asac"Heads up for we're backing out the SQLite upgrade."15:46
asacseems only on 1.9.015:46
ftafor jaunty, i think 3.6.4 is a good idea. upstream says "Version of SQLite is recommended for all new development. Upgrading from versions 3.6.4 through 3.6.6 is strongly recommented."15:47
ftaasac, i just asked pitti15:55
* fta going out for ~1/2h16:02
ftaasac, http://launchpadlibrarian.net/20030832/buildlog_ubuntu-jaunty-i386.xulrunner-1.9.1_1.9.1%7Eb2%2Bbuild1%2Bnobinonly-0ubuntu1_FAILEDTOBUILD.txt.gz16:43
ftayou broke it :(16:44
ftaasac, my bad for not testing your last commit :(16:46
ftatoo bad :(16:57
asacfta: the patch rename?17:04
asacdumb me17:04
ftayou renamed the patch, but forgot the series17:04
asacfta: just reupload the same changelog17:04
asacwith version bumped17:04
ftatoo late17:04
asacfta: bad17:04
asacinitial uploads should have the full changelog ;)17:05
asacbut well17:05
ftapeople don't care about xul, they will read ff17:05
asacfta: yeah. things that dont get published not need a new changelog ... for future ;)17:06
asacbut ok17:06
ftaok, i'll try to remember that17:06
asaci sometimes forget it too17:06
asacfta: once we have nspr/nss up we need to respin everything ;) ... good for upload count17:08
asactoo bad that most rdepends seem to be in main17:09
asaclibgeier0 ;)17:10
* asac merges NM 0.717:33
asacreally bad that most fixes landed after our release ;)17:34
asacand first thing they did before they fixed things, they changed API/ABI17:34
asacso just upgrading to 0.7 isnt possible17:34
asacand backporting is similar painful17:35
asacbecause they switched from using struct members directly to accessor functions everywhere17:35
ftag++ -o nsNSSCertificate.o -c -I../../../../dist/include/system_wrappers -include ../../../../config/gcc_hidden.h -DNSS_ENABLE_ECC -DXPCOM_TRANSLATE_NSGM_ENTRY_POINT=1 -DMOZILLA_INTERNAL_API -D_IMPL_NS_COM -DEXPORT_XPT_API -DEXPORT_XPTC_API -D_IMPL_NS_COM_OBSOLETE -D_IMPL_NS_GFX -D_IMPL_NS_WIDGET -DIMPL_XREAPI -DIMPL_NS_NET -DIMPL_THEBES  -DOSTYPE=\"Linux2.6\" -DOSARCH=Linux -I/usr/include/nss -I. -I. -I../../../../dist/include/nspr -I../../../../18:03
ftadist/include/xpcom -I../../../../dist/include/string -I../../../../dist/include/necko -I../../../../dist/include/uriloader -I../../../../dist/include/pref -I../../../../dist/include/docshell -I../../../../dist/include/caps -I../../../../dist/include/dom -I../../../../dist/include/intl -I../../../../dist/include/locale -I../../../../dist/include/profile -I../../../../dist/include/windowwatcher -I../../../../dist/include/js -I../../../../dist/inclu18:03
ftade/widget -I../../../../dist/include/layout -I../../../../dist/include/content -I../../../../dist/include/xpconnect -I../../../../dist/include/unicharutil -I../../../../dist/include/pipboot -I../../../../dist/include   -I../../../../dist/include/pipnss -I/usr/include/nspr   -I/usr/include  -I/build/buildd/xulrunner-1.9.1-1.9.1~b2+build1+nobinonly/build-tree/mozilla/dist/sdk/include    -fPIC   -fno-rtti -fno-exceptions -Wall -Wpointer-arith -Wover18:03
ftaloaded-virtual -Wsynth -Wno-ctor-dtor-privacy -Wno-non-virtual-dtor -Wcast-align -Wno-invalid-offsetof -Wno-long-long -pedantic -g -fno-strict-aliasing -fshort-wchar -pthread -pipe  -DNDEBUG -DTRIMMED -Os -freorder-blocks -fno-reorder-functions    -DMOZILLA_CLIENT -include ../../../../mozilla-config.h -Wp,-MD,.deps/nsNSSCertificate.pp nsNSSCertificate.cpp18:03
ftansNSSCertificate.cpp: In member function 'virtual nsresult nsNSSCertificate::GetAllTokenNames(PRUint32*, PRUnichar***)':18:04
ftansNSSCertificate.cpp:913: error: 'PK11_GetAllSlotsForCert' was not declared in this scope18:04
ftamake[6]: *** [nsNSSCertificate.o] Error 118:04
ftamake[6]: Leaving directory `/build/buildd/xulrunner-1.9.1-1.9.1~b2+build1+nobinonly/bui18:04
ftahow come i didn't come into this earlier ? b2 *is* in my ppa18:05
ftaasac, ^^18:06
fta--with-system-nspr --with-system-nss ??? eehhhhh ?18:08
asacfta: thats why i asked if it builds with old nss/nspr18:09
asaclets see if its in new symbols but not in old18:09
ftai thought i was using in-source nss, but it's just ff, not xul !?18:09
ftatime to push nspr/nss. trying in my ppa 1st.18:11
ftalooks like i have the opportunity to fix the changelog after all18:12
asacfta: fix changelog?18:15
ftawhat you proposed earlier18:15
asacwhat did i propose?18:16
asacyeah ;)18:16
fta<asac> fta: just reupload the same changelog18:16
asacin xulrunner 1.9.118:16
asacthought you want to fix nss ;)18:16
ftai think i should fix the nss/nspr deps too18:16
* asac is a context-less bot ;)18:16
asacfta: yes. fix the test18:16
asacso it uses in-source ... we will respin anyway when nss/nspr is up18:17
asacjust so that it really uses the new libs and not the links18:17
ftabuilding your stuff this time...18:17
asacmy stuff?18:18
asacin ppa ?18:19
ftai need to check what pkg-config reports now18:19
asachopefully the right upstream versoin ;)18:19
asacName: NSS18:21
asacDescription: Mozilla Network Security Services18:21
asacName: NSPR18:21
asacDescription: The Netscape Portable Runtime18:21
asacVersion: 4.7.118:21
asachmm ... somewhat wrong i guess ;)18:22
asacbut as long as it was bumped its ok i guess18:22
asacoh i have the old ;)18:22
asacon this machine18:22
asacName: NSS18:23
asacDescription: Mozilla Network Security Services18:23
asacVersion: 3.12.218:23
asacName: NSPR18:23
asacDescription: The Netscape Portable Runtime18:23
asacVersion: 4.7.318:23
asacmakes more sens18:23
ftaboth sent to my ppa18:23
ftaI hope i'll not be flooded by emails like for the subpixel change in xul18:24
asacfta: so to test: 1st -> test that old apps work with new binaries18:24
asac2nd -> test that building rdepends creates proper lower bounds on the new binary versoins18:25
asacfta: we need to find a smarter pattern to guess the right maxversion/minversion at build time18:28
asacsomething like looking at pkg-config version and then guessing the right min/max version thing18:28
asacdoesnt make sense to fix ephy upstream to 1.9 ... it works well with 1.9.1 if its build against 1.9.118:29
asacok ... now i probably loose network18:29
asactesting something18:29
ftaasac, are you sure ephy is fine when built with 1.9.1 ?18:34
asacfta: yes. worked here quite good18:45
asacat least my dev tree18:45
asacif package doesnt work it must be something related to packaging18:45
=== fta_ is now known as fta
fta<fta> asac, http://launchpadlibrarian.net/20032926/buildlog_ubuntu-jaunty-hppa.epiphany-browser_2.24.1-1ubuntu2_FAILEDTOBUILD.txt.gz19:02
fta<fta> checking whether we can compile and run XPCOM programs... no19:02
fta<fta> configure: error: Cannot compile and run XPCOM programs19:02
asacfta: ah ... i think i remember19:13
asacfta: did you commit your uploaded stuff yet?19:22
ftanot yet, i'm still testing nss19:22
ftaseems fine19:22
asacfta: please push 1.9.1 then ;)19:23
asacyou can go on testing19:23
asacfta: to bzr i mean ;)19:23
ftaseems all fine for epy, ff3, ff3.119:27
asacfta: is seb still there?19:50
asacotherwise i can upload that19:50
ftaupload what?19:51
asacmaxVersion stuff19:51
ftaseb did it already19:51
ftai'm ready to re-push xul19:52
asacDO it19:52
asacmost likely pitti wont be back till monday ;) ... so binary new might need to wait a bit19:52
ftai hope it's good this time :P19:54
ftanice page: https://edge.launchpad.net/ubuntu/+archivemirrors19:58
ftahttps://edge.launchpad.net/ubuntu/+ppas :)))19:59
=== fabrice_sp_ is now known as fabrice_sp

Generated by irclog2html.py 2.7 by Marius Gedminas - find it at mg.pov.lt!